affixe
label: affix
label: aplică @ro
label: affisso @it
label: аффикс @ru
label: afijo @es
comment: An affix is a lexical entry that represents a morpheme (suffix, prefix, infix, circumfix) that is attached to a word stem to form a new word.
label: Affix @de
label: affiks @af
subclass of: lexical entry
type: Class
term status: stable
comment: 'Аффикс' - это словарная единица, которая представляет морфему (суффикс, префикс, инфикс, циркумфикс), добавляемую к основе слова для образования нового слова. @ru

is evoked by
type: ObjectProperty
label: wordt uitgelokt door @nl
label: es evocado por @es
range: lexical entry
term status: stable
label: word opgeroep deur @af
label: framkallas av @sv
label: wird hervorgerufen von @de
comment: Отношение обратное к 'порождает'. @ru
inverse of: evokes
label: порождается @ru
label: è evocato da @it
label: este evocat de @ro
comment: The inverse relation to evokes.
domain: lexical concept
label: est évoqué par @fr

morphological pattern
comment: The 'morphological pattern' property indicates the morphological class of a word.
term status: stable
label: morfologische patroon @nl
label: model morfologic @ro
domain: lexical entry
label: patrón morfológico @es
label: morfologiskt mönster @sv
label: motivo morfologico @it
label: morphologisches Muster @de
type: ObjectProperty
comment: Свойство 'морфологическая модель' обозначает морфологический класс слова. @ru
label: морфологическая модель @ru
label: patron morphologique @fr
label: morfologiese patroon @af

denotes
label: обозначает @ru
term status: stable
label: betecknar @sv
comment: The 'denotes' property relates a lexical entry to a predicate in a given ontology that represents its meaning and has some denotational or model-theoretic semantics.
type: ObjectProperty
label: bezeichnet @de
label: dénote @fr
label: dui aan @af
label: denota @es
domain: lexical entry
label: duidet aan @nl
range: Resource
property chain axiom: sense
property chain axiom: reference
label: denotă @ro
sub property of: denotes
comment: Свойство 'обозначает' связывает словарную единицу с предикатом в онтологии, который представляет ее значение и обладает денотативной или теоретико-модельной семантикой. @ru

Lexicon Model for Ontologies - Core
version info: 1.1
modified: 2016-01-10
publisher: ontolex
contributor: anas-fahad-khan
contributor: fiorelli
licence: https://creativecommons.org/publicdomain/zero/1.0/
preferred namespace uri: http://www.w3.org/ns/lemon/ontolex#
rights: CC-Zero
type: Vocabulary
contributor: 53-lupe
creator: www.cimiano.de
creator: john.mccr.ae
license: https://creativecommons.org/publicdomain/zero/1.0/
type: Ontology
issued: 2016-01-10
comment: -Version 1.0: depreciation with minor change in metadata for LOV publication -Version 1.1: creation
contributor: 52-emontiel
contributor: web
contributor: francescafrontini
preferred namespace prefix: ontolex
contributor: www.paulbuitelaar.net
description: A model for the representation of lexical information relative to ontologies. Core module.
contributor: ~declerck
contributor: aldo-gangemi
contributor: stellato

evokes
label: roep op @af
comment: Свойство 'порождает' связывает словарную единицу с одним из лексических понятий, которую она порождает, то есть мыслительное понятие, которое возникает в сознании говорящих, когда они слышат данную словарную единицу. @ru
comment: The 'evokes' property relates a lexical entry to one of the lexical concepts it evokes, i.e. the mental concept that speakers of a language might associate when hearing the lexical entry.
label: framkallar @sv
label: порождает @ru
label: evoca @it
label: ruft hervor @de
label: évoque @fr
label: lokt uit @nl
type: ObjectProperty
domain: lexical entry
label: evocă @ro
property chain axiom: sense
property chain axiom: is lexicalized sense of
term status: stable
range: lexical concept

lexical form
comment: Свойство 'лексическая форма' соотносит словарную единицу с одним вариантом грамматической формы словарной единицы. @ru
comment: The 'lexical form' property relates a lexical entry to one grammatical form variant of the lexical entry.
term status: stable
label: лексическая форма @ru
label: lexikalische Form @de
label: formă lexicală @ro
type: ObjectProperty
label: lexikonform @sv
label: lexikaal vorm @nl
label: forme lexicale @fr
label: forma léxica @es
domain: lexical entry
range: form
label: forma lessicale @it
label: leksikale vorm @af

written representation
label: representação escrita @pt
label: schriftlijke voorstelling @nl
label: rappresentazione scritta @it
label: skriven form @sv
label: письменное представление @ru
label: reprezentare scrisă @ro
comment: The 'written representation' property indicates the written representation of a form.
type: DatatypeProperty
comment: Свойство 'письменное представление' обозначает письменное представление формы. @ru
label: geskrewe voorstelling @af
term status: stable
label: representación escrita @es
label: schriftliche Darstellung @de
domain: form
sub property of: representation
range: langString
label: représentation écrite @fr

sense
type: InverseFunctionalProperty
range: lexical sense
label: Sinn @de
label: sentido @pt
label: betydelse @sv
label: sens @ro
type: ObjectProperty
comment: Свойство 'смысл' связывает словарную единицу с одним из ее лексических смыслов. @ru
label: zin @nl
label: senso @it
comment: The 'sense' property relates a lexical entry to one of its lexical senses.
label: sinne @af
domain: lexical entry
label: acepción @es
label: signification @fr
term status: stable
label: смысл @ru
inverse of: is sense of

usage
label: uso @it
label: употребление @ru
type: ObjectProperty
term status: stable
domain: lexical sense
range: Resource
comment: The 'usage' property indicates usage conditions or pragmatic implications when using the lexical entry to refer to the given ontological meaning.
comment: Свойство 'употребление' обозначает условия использования или прагматическое значение при употреблении словарной единицы для соотнесения с определенным значением в онтологии. @ru
label: gebruik @nl
label: Gebrauch @de

other form
label: andere vorm @nl
domain: lexical entry
label: другая форма @ru
label: otra forma @es
comment: Свойство 'другая форма' связывает словарную единицу с малоупотребительной формой ("не леммой"), которая является реализацией данной словарной единицы @ru
type: ObjectProperty
label: autre forme @fr
label: altra forma @it
sub property of: lexical form
range: form
comment: The 'other form' property relates a lexical entry to a non-preferred ("non-lemma") form that realizes the given lexical entry.
label: annan form @sv
term status: stable
label: andere Form @de
label: ander form @af
label: altă formă @ro
label: outra forma @pt

is lexicalized sense of
inverse of: lexicalized sense
comment: The object property isLexicalizedSenseOf is the inverse property of lexicalized sense.
domain: lexical sense
label: est le sens lexicalisé de @fr
label: är lexikaliserad betydelse för @sv
comment: Свойство объекта 'является лексикализованным смыслом' представляет собой свойство, обратное к свойству 'лексикализованный смысл'. @ru
label: es l'acepción lexicalizado de @es
type: ObjectProperty
range: lexical concept
label: is lexikaal zin van @nl
label: является лексикализованным смыслом @ru
label: è il senso lessicalizzato di @it
label: is geleksikaliseerde sin van @af
label: este sens lexicalizat de @ro
label: ist lexikalisierter Sinn von @de
term status: stable

representation
comment: The 'representation' property indicates a string by which the form is represented according to some orthography.
type: DatatypeProperty
label: rappresentazione @it
label: reprezentare @ro
term status: stable
range: langString
label: представление @ru
label: representación @es
label: représentation @fr
label: voorstelling @nl
label: Darstellung @de
comment: Свойство 'представление' обозначает некую последовательность, с помощью которой форма может быть представлена средствами орфографии. @ru
label: representação @pt
domain: form

form
comment: A form represents one grammatical realization of a lexical entry.
term status: stable
label: forma @it
label: forme @fr
subclass of: Thing
label: Forma @pt
label: vorm @af
subclass of: Restriction
  min qualified cardinality: 1
  on property: written representation
  on data range: langString
label: форма @ru
label: formă @ro
comment: 'Форма' представляет одну грамматическую реализацию словарной единицы. @ru
label: Form @de
type: Class

lexicalized sense
comment: Свойство 'лексикализованный смысл' связывает лексическое понятие с соответствующим лексическим смыслом, который лексикализует понятие. @ru
label: geleksikaliseerde Sin @af
label: sens lexicalizat @ro
label: lexikaal zin @nl
label: лексикализованный смысл @ru
label: acepción lexicalizada @es
label: lexikalisierter Sinn @de
comment: The 'lexicalized sense' property relates a lexical concept to a corresponding lexical sense that lexicalizes the concept.
label: senso lessicalizzato @it
domain: lexical concept
type: ObjectProperty
label: signification lexicalisé @fr
range: lexical sense
term status: stable
label: lexikaliserad betydelse @sv

lexical concept
label: concepto lexicalizado @es
comment: A lexical concept represents a mental abstraction, concept or unit of thought that embodies the meaning of one or more lexical entries.
term status: stable
label: lexikalisches Konzept @de
label: concetto lessicale @it
label: concept lexical @ro
label: лексическое понятие @ru
label: lexikaliskt begrepp @sv
subclass of: meaning
subclass of: concept
label: conceito léxico @pt
label: leksikale konsep @af
comment: 'Лексическое понятие' представляет элемент абстрактного мышления, понятие или единицу мысли, которая может быть лексикализована определенным набором смыслов. @ru
type: Class
label: lexikaal concept @nl

multi-word expression
label: mutliwoorduitdrukking @nl
label: expression à mots multiples @fr
label: expresie din mai multe cuvinte @ro
term status: stable
label: Mehrwortausdruck @de
comment: 'Словосочетание' - это словарная единица, состоящая из двух или более слов. @ru
subclass of: lexical entry
type: Class
label: expresión multipalabra @es
label: multiwoorduitdrukking @af
label: словосочетание @ru
label: flerordsuttryck @sv
comment: A multiword expression is a lexical entry that consists of two or more words.
label: espressione di gruppi di parole @it

word
term status: stable
subclass of: lexical entry
label: parola @it
label: cuvânt @ro
comment: 'Слово' - это словарная единица, представяющая собой единичную реализацию лексемы. @ru
label: woord @af
label: palabra @es
label: mot @fr
label: слово @ru
label: Wort @de
label: ord @sv
type: Class
comment: A word is a lexical entry that consists of a single token.

is concept of
label: är begrepp för @sv
comment: Это свойство формализует значение 'Лексического Понятия', связывая его с отдельным значением в онтологии. @ru
label: est un concept pour @fr
term status: stable
label: é conceito de @pt
type: ObjectProperty
label: is konsep van @af
label: является понятием @ru
label: is concept van @nl
comment: This property formalizes the meaning of a Lexical Concept by linking it to a particular ontological meaning.
label: este concept a(l) @ro
label: è concetto di @it
domain: lexical concept
label: es concepto de @es
label: ist Konzept von @de

reference
label: референция @ru
label: referens @sv
type: ObjectProperty
comment: Свойство 'референция' соотносит лексический смысл с предикатом в онтологии, который уточняет значение денотата (соответствующей словарной единицы). @ru
term status: stable
label: référence @fr
comment: The 'reference' property relates a lexical sense to an ontological predicate that represents the denotation of the corresponding lexical entry.
label: riferimento @it
label: verwysing @af
domain: Class
  union of: lexical sense
  union of: OntoMap
label: referencia @es
type: FunctionalProperty
label: referință @ro
label: referntie @nl
range: Resource
label: Referenz @de
label: referência @pt

phonetic representation
label: fonetische voorstelling @nl
label: fonetisk representation @sv
label: fonetiese voorstelling @af
label: reprezentare fonetică @ro
label: фонетическое представление @ru
label: représentation phonétique @fr
comment: The 'phonetic representation' property indicates one phonetic representation of the pronunciation of the form using a scheme such as the International Phonetic Alphabet (IPA).
label: representación fonética @es
term status: stable
comment: Свойство 'фонетическое представление' обозначает фонетическое представление произношения формы с использованием какой-либо схемы, например, Международного фонетического алфавита (IPA, МФА). @ru
domain: form
sub property of: representation
label: rappresentazione fonetica @it
label: phonetische Darstellung @de
range: langString
type: DatatypeProperty

is denoted by
label: es denotado por @es
comment: The object property isDenotedBy is the inverse of the object property denotes.
type: ObjectProperty
inverse of: denotes
domain: Resource
label: este denotat cu @ro
label: wordt aangeduidet door @nl
label: wird bezeichnet von @de
range: lexical entry
label: é denotado por @pt
label: word aangedui deur @af
label: обозначается @ru
label: è denotato da @it
label: betecknas av @sv
term status: stable
label: est dénoté par @fr
comment: Свойство объекта 'обозначается' является обратным к свойству объекта 'обозначает'. @ru

concept scheme
type: Class

lexical entry
subclass of: Thing
subclass of: expression
type: Class
label: înregistrare lexicală @ro
label: leksikale inskrywing @af
label: Lexikoneintrag @de
label: словарная единица @ru
subclass of: Restriction
  on property: canonical form
  on class: form
  max qualified cardinality: 1
label: entrata lessicale @it
label: lexikaal item @nl
label: entrée lexicale @fr
label: lexikoningång @sv
comment: A lexical entry represents a unit of analysis of the lexicon that consists of a set of forms that are grammatically related and a set of base meanings that are associated with all of these forms. Thus, a lexical entry is a word, multiword expression or affix with a single part-of-speech, morphological pattern, etymology and set of senses.
label: entrada léxica @es
comment: 'Словарная единица' представляет собой единицу анализа словаря, которая состоит из совокупности грамматически связанных форм и совокупности основных значений, ассоциирующихся со всеми этими формами. 'Словарная единица' - это слово, словосочетание или аффикс одной части речи, морфологической модели, этимологии и набора значений. @ru
term status: stable
subclass of: Restriction
  on property: lexical form
  min qualified cardinality: 1
  on class: form

begrip
range: lexical concept
label: concept
label: понятие @ru
label: concepto @es
term status: stable
inverse of: is concept of
comment: Свойство 'понятие' связывает сущность в онтологии с лексическим понятием, которое представляет соответствующее значение. @ru
label: conceito @pt
label: concetto @it
type: ObjectProperty
comment: The 'concept' property relates an ontological entity to a lexical concept that represents the corresponding meaning.
label: begrepp @sv
label: konsep @af
label: Konzept @de

canonical form
label: каноническая форма @ru
label: canonieke vorm @nl
comment: Свойство 'каноническая форма' связывает словарную единицу с ее канонической или словарной формой. Она обычно обозначает "лемму" словарной единицы. @ru
label: kanonische Form @de
term status: stable
type: ObjectProperty
label: kanonisk form @sv
label: kanoniese vorm @af
label: forme canonique @fr
label: forma canonica @pt
range: form
type: FunctionalProperty
label: formă canonică @ro
sub property of: lexical form
comment: The 'canonical form' property relates a lexical entry to its canoncical or dictionary form. This usually indicates the "lemma" form of a lexical entry.
domain: lexical entry
label: forma canónica @es

lexical sense
label: lexikonbetydelse @sv
subclass of: Restriction
  on property: reference
  cardinality: 1
label: sens lexical @ro
subclass of: meaning
label: lexikaal zin @nl
subclass of: Restriction
  on class: lexical entry
  on property: is sense of
  qualified cardinality: 1
label: лексический смысл @ru
label: signification lexicale @fr
type: Class
label: senso lessicale @it
label: lexikalischer Sinn @de
comment: 'Лексический смысл' обозначает лексическое значение словарной единицы, когда оно понимается как относящееся к соответствующему элементу онтологии. 'Лексический смысл' представляет собой овеществление пары, состоящей из однозначно определяемой словарной единицы и однозначно определяемой сущности отнологии, к которой относится данный лексический смысл. Связь между словарной единицей и сущностью в онтологии посредством объекта 'Лексический Смысл' подразумевает, что словарная статья может быть использована для отсылки к соответствующей сущности в онтологии. @ru
label: leksikale sin @af
term status: stable
label: acepción léxica @es
comment: A lexical sense represents the lexical meaning of a lexical entry when interpreted as referring to the corresponding ontology element. A lexical sense thus represents a reification of a pair of a uniquely determined lexical entry and a uniquely determined ontology entity it refers to. A link between a lexical entry and an ontology entity via a Lexical Sense object implies that the lexical entry can be used to refer to the ontology entity in question.

concept set
type: Class
label: banca concetti @it
label: Konzeptsatz @de
label: набор понятий @ru
equivalent class: Restriction
  min qualified cardinality: 1
  on class: lexical concept
  on property: in scheme
comment: 'Набор понятий' представляет собой совокупность лексических понятий. @ru
label: conjunto de conceptos @es
label: verzameling van begrippen @nl
label: banque de conepts @fr
comment: A concept set represents a collection of lexical concepts.
term status: stable
subclass of: concept scheme

is reference of
label: é referência de @pt
label: är referens för @sv
label: is verwysing van @af
range: Class
  union of: lexical sense
  union of: OntoMap
type: ObjectProperty
domain: Resource
inverse of: reference
label: è riferimento di @it
label: es referencia de @es
label: is referentie van @nl
comment: The object property isReferenceOf is the inverse property of reference.
type: InverseFunctionalProperty
comment: Свойство объекта 'является референцией' представляет собой свойство, обратное к свойству 'референция'. @ru
label: является референцией @ru
label: est référence de @fr
term status: stable
label: ist Referenz von @de
label: este referință a(l) @ro

is sense of
range: lexical entry
label: é sentido de @pt
comment: Свойство 'является смыслом' представляет собой свойство, обратное к свойству 'смысл'. @ru
type: ObjectProperty
label: est signification de @fr
label: es acepción de @es
comment: The property isSenseOf is the inverse property of sense.
label: är betydelse för @sv
label: è il senso di @it
label: is zin van @nl
label: este sens a(l) @ro
domain: lexical sense
label: is sin van @af
type: FunctionalProperty
label: ist Sinn von @de
term status: stable
label: является смыслом @ru

expression
type: Class

concept
type: Class

meaning
type: Class

in scheme
type: ObjectProperty